BDBM67724 (3-methoxyphenyl)-[1-(m-tolyl)pyrazolo[3,4-d]pyrimidin-4-yl]amine::MLS000077456::N-(3-methoxyphenyl)-1-(3-methylphenyl)-4-pyrazolo[3,4-d]pyrimidinamine::N-(3-methoxyphenyl)-1-(3-methylphenyl)pyrazolo[3,4-d]pyrimidin-4-amine::SMR000035757::cid_661236
SMILES COc1cccc(Nc2ncnc3n(ncc23)-c2cccc(C)c2)c1
InChI Key InChIKey=DTEFNRBROLTDDL-UHFFFAOYSA-N
Data  3 IC50
  Tab Delimited (TSV)   2D SDfile   Computed 3D by Vconf -m prep SDfile
Find this compound or compounds like it in BindingDB:
Activity Spreadsheet -- Enzyme Inhibition Constant Data from BindingDB
Found 2 hits for monomerid = 67724
TargetDNA damage-inducible transcript 3 protein(Mus musculus)
Emory University
Curated by PubChem BioAssay
LigandPNGBDBM67724((3-methoxyphenyl)-[1-(m-tolyl)pyrazolo[3,4-d]pyrim...)
Affinity DataIC50:  550nM. Assay description: NIH Molecular Libraries Screening Centers Network [MLSCN] Emory Chemical Biology Discovery Center in MLSCN Assay provider: Dr. Randal Kaufman, Univer...
In DepthDetails PCBioAssay
TargetDNA damage-inducible transcript 3 protein(Mus musculus)
Emory University
Curated by PubChem BioAssay
LigandPNGBDBM67724((3-methoxyphenyl)-[1-(m-tolyl)pyrazolo[3,4-d]pyrim...)
Affinity DataIC50:  550nM. Assay description: NIH Molecular Libraries Screening Centers Network [MLSCN] Emory Chemical Biology Discovery Center in MLSCN Assay provider: Dr. Randal Kaufman, Univer...
In DepthDetails PCBioAssay